{"text_format":"1","workbook":"xlsx","n_sheets":7,"sheets":["Terms and conditions","Design","Lookups","Points Table A","Points Table C","Draft calculator","Drop-down, HSR categories"],"not_rendered":{"charts":12,"images":0,"macros":1,"external_links":2,"defined_names":194,"comments":1,"pivot_tables":0},"unopened":[],"bounds":{"document_bytes":16777216,"sheet_cells":100000,"rows_first":2000,"rows_last":500,"rows_between":2000,"halvings":0,"cell_chars":16384,"cell_head_chars":4096},"cells_cut":0,"cells_raw":0,"read":"whole","date_system":"1900"}

{"sheet":"Terms and conditions","index":0,"n_rows":32,"n_cols":1,"rows_kept":32,"cut":false,"hidden":true,"merged":[]}
["Licence"]
["The Health Star Rating Calculator is licensed only on the condition that you agree to the terms and conditions set out below. Please read these terms and conditions carefully. If you agree to be bound by the terms and conditions, you should continue to use this calculator. If you do not agree to be bound by the terms and conditions, you should close this calculator."]
[]
["Disclaimer"]
["The Commonwealth does not warrant that the results generated by the calculator will be free from error, or if used will ensure compliance with the relevant requirements of the Australia New Zealand Food Standards Code."]
[]
["Note that the accuracy of the final score calculated by the calculator will be dependent on the accuracy of the data entered into the calculator."]
[]
["Consequently, before relying on the results generated by the calculator, you should carefully evaluate the accuracy, completeness and relevance of the results for your purposes, and should obtain appropriate expert advice relevant to your own particular circumstances."]
[]
["The Commonwealth makes this calculator available on the understanding that users exercise their own skill, care and judgement; and seek independent expert advice with respect to its use."]
[]
["By accessing this calculator, you acknowledge that the Commonwealth will not be liable for any incidental or consequential damages resulting from its use."]
[]
["Copyright"]
["This work is copyright."]
["© Commonwealth of Australia 2014"]
[]
["The Commonwealth grants you a non-exclusive, non-transferable right to access, use and display the calculator, provided that you comply fully with these terms and conditions:"]
["1. you may display, print and reproduce this material in unaltered form only (retaining this notice) for your own personal use or use within your organisation; "]
["2. apart from any other use permitted under the Copyright Act 1968 (Cth), all other rights are reserved; "]
["3. you may not use any part of the calculator to establish, maintain, or provide, or assist in establishing, maintaining or providing your own publications, whether on the internet or otherwise; and "]
["4. in particular, you may not sell access to the calculator or any material derived from the calculator. "]
[]
["Requests for further authorisation should be directed to:"]
["Communications Branch"]
["Department of Health"]
["GPO Box 9848"]
["Canberra ACT 2610"]
["Australia"]
[]
["Email: copyright@health.gov.au "]

{"sheet":"Design","index":1,"n_rows":24,"n_cols":7,"rows_kept":24,"cut":false,"hidden":true,"merged":[[3,1,9,1],[1,3,1,5],[1,1,2,2],[1,6,2,6]]}
[]
[null,"FoPL System Design",null,"NPSC Categories",null,null,"FoPL Calibration Solution"]
[null,null,null,"(1) Beverages","(2) Food","(3) Fats, Cheese"]
[null,"AGHE Categories","Vegetables","Beverages, non-dairy (whole juices, >80% FVNL are considered Core)","Vegetables (potato, broccoli cabbage, legumes, tomatoes, tinned peas, corn, etc - processed & unprocessed. Combinations thereof)","N/A","Calibrate using NPSC Beverages & NPSC Food end points respectively"]
[null,null,"Core Cereals","Beverages, non-dairy (unfortified rice milk, etc)","Core cereals (bread, rice, pasta, breakfast cereals, polenta, grains and their components - processed and unprocessed. Combinations thereof)","N/A","Calibrate using NPSC Beverages & NPSC Food end points respectively"]
[null,null,"Protein","Core dairy - beverages (fortified soy milk, etc)","Protein (meat, fish, poultry, eggs, nuts, legumes, tofu, etc - processed and unprocessed. Combinations thereof)","N/A","Calibrate using FoPL Core Dairy (beverages) & NPSC Food end points respectively"]
[null,null,"Core Dairy","Core dairy - beverages (many variants of milk)","Core dairy - yoghurt, soft cheese (Ca =< 320 mg/100g)","Core dairy - cheese (hard cheese, Ca >320 mg/100g)","Calibrate separately as part of Core Dairy, using FoPL end points from each class"]
[null,null,"Fruit","Beverages, non-dairy (whole juices, => 90% FVNL are considered Core)","Fruit (bananas, grapes, apples, oranges, watermelon, etc - processed and unprocessed. Combinations thereof)","N/A","Calibrate using NPSC Beverages & NPSC Food end points respectively"]
[null,null,"Non-core foods","Beverages, non-dairy (carbonated beverages, alcohol, cordials, juices < 90% FVNL, etc)","Non-core foods (chips, pies, cakes, biscuits, pastry, snacks, meals and meal bases, soups, stocks, sugar, salt, sauces, dressings, condiments, pizza, dips, jelly, icecream, custard, cream, cream cheese, soft drinks, confectionery)","N/A","Calibrate using NPSC Beverages & NPSC Food end points respectively"]
[null,null,"Fats/Oils","N/A","N/A","Fats, oils (butter, margarine, olive oil, canola oil, vegetable oils. Other oils)","Calibrate separately using NPSC end points for Fats/oils"]
[]
[null,"AGHE categories (for reference purposes)"]
[null,"Core Cereals",null,"Core cereals include bread, rice, pasta, breakfast cereals, polenta, grains, components of grains"]
[null,"Core Dairy & Analogues",null,"Core Dairy & Analogues includes milk, cheese, yoghurt & analogues"]
[null,"Protein Foods",null,"Protein foods include meat, fish, poultry, eggs, nuts, legumes, tofu"]
[null,"Fruit",null,"Fruit includes bananas, grapes, apples, oranges, watermelon, etc & whole juices"]
[null,"Vegetables",null,"Vegetables includes processed and unprocessed potato, broccoli cabbage, legumes, tomatoes, corn, chick peas, etc, and whole juices"]
[null,"Fats & Oils",null,"Fats & Oils includes butter, margarine, olive oil, canola oil, vegetable oils. Any other oils."]
[null,"Non-core foods",null,"Off-plate food includes chips, pies, cakes, biscuits, pastry, snacks, meals and meal bases, soups, stocks, sugar, salt, sauces, dressings, "]
[null,null,null,"condiments, pizza, dips, jelly, icecream, custard, cream, cream cheese, soft drinks, confectionery & alcohol"]
[null,null,null,"Also includes \"Other\" foods either not on the plate, or from multiple parts of the plate without a particular dominance."]
[]
[null,"Not in the FoPL System"]
[null,"Water",null,"Water includes; tap water, spring water, carbonated water"]

{"sheet":"Lookups","index":2,"n_rows":135,"n_cols":14,"rows_kept":135,"cut":false,"hidden":true,"merged":[]}
["Star score","Symbols","Star Conversion Divisor"]
[1,"²",{"$f":"A55","v":"Beverages, non-dairy"},{"$f":"IF(D55<9,D55+0.999,9.999)","v":9.9990000000000006}]
[2,"«","Core Cereals",9.9990000000000006]
[3,"«²","Core Dairy - beverages",8.9990000000000006]
[4,"««","Core Dairy - cheese",9.9990000000000006]
[5,"««²","Core Dairy - yoghurt, soft cheese",9.9990000000000006]
[6,"«««","Fats, oils",9.9990000000000006]
[7,"«««²","Fruit",9.9990000000000006]
[8,"««««","Non-core foods",9.9990000000000006]
[9,"««««²","Protein",9.9990000000000006]
[10,"«««««","Vegetables",9.9990000000000006]
[null,null,"If %Food range < 9 then Range = Range + 0.999, else Range = 9.999"]
[null,null,"Required because not all categories have HSRC range >10"]
["Scaling Criteria:"]
["(1) Healthy reference foods in each category typically achieve at least four stars"]
["(2) Non-healthy reference foods in each category typically achieve half to one star"]
["(3) Foods considered to be Core to score at least 3 stars"]
["(4) The star score range extends from five stars, downwards to least healthy scores in each NPSC category"]
["(5) Foods will score star points within the range of star points so established"]
["(6) Categories with a range of NPSC points <10 (<5 stars) will start at 5 stars and extend downwards"]
["(7) The 'most healthy' food will be set at an NPSC score at or below the 5% quantile of NPSC scores for the category"]
["(8) The 'least healthy' food will be set by an NPSC score at or above the 95% quantile of NPSC scores for the category"]
[]
["More healthy reference foods =>4 stars:"]
[{"$f":"A55","v":"Beverages, non-dairy"},"Whole fruit juices, typically > 67% FVNL, <13.6% total sugars"]
[{"$f":"A56","v":"Core Cereals"},"Whole grain foods, high fibre, protein increased"]
["Core Dairy - beverages","Low fat milks and alternatives (typically <2.1% sat fat and/or > 3.1% protein)"]
["Core Dairy - cheese","Reduced fat cheese, reduced sodium"]
["Core Dairy - yoghurt, soft cheese","Lite yoghurt, cottage cheese"]
["Fats, oils","Extra lite spreads, canola, olive oils"]
["Fruit","Unprocessed fruit"]
["Non-core foods","Typically whole grain biscuits and snacks, occasional foods low in saturated fat, sugar and sodium"]
["Protein","Trimmed meat/fish, whole legumes, raw nuts"]
["Vegetables","Unprocessed vegetables"]
[]
[]
["Less healthy reference foods =<1 star:",null,null,null,null,null,"↓ = more ²","↑ = more «««««",null,null,"↓ = more ²","↑ = more «««««"]
[{"$f":"A55","v":"Beverages, non-dairy"},"Beverages typically 0% FVNL, sugars >13.6%",null,null,null,"Original scaling tables",null,null,null,"TAG mods"]
[{"$f":"A56","v":"Core Cereals"},"Typically highly refined, high sugar, low fibre ceral foods",null,null,null,"Beverages, non-dairy",3,-6,null,"Beverages, non-dairy",3,-6]
["Core Dairy - beverages","Full fat, sweetened, flavoured milks, typically with protein <3.2%, sugar >9.1%",null,null,null,"Core Cereals",29,-15,null,"Core Cereals",29,-15]
{"$rows_left_out":96}
{"sheet":"Points Table A","index":3,"n_rows":108,"n_cols":22,"rows_kept":108,"cut":false,"hidden":true,"merged":[[38,12,39,12],[38,0,38,4],[38,5,38,8],[38,9,39,9],[38,10,39,10],[38,11,39,11]]}
["For HC calcs","Extended HSR tables, category 1&2 foods",null,null,null,null,null,"Extended tables, category 3 foods, as per 1.2.7"]
["NPSC sugar table","Energy, kj","Sat fat g","Tot Sug g","Na, mg","NPSC/HSR Points",null,"Energy, kj","Sat fat g","Tot Sug g","Na, mg","NPSC/HSR Points",null,"Graph for Cat 1&2 foods - all Cat 3 tables are linear",null,null,null,null,null,null,null,"Graph for Cat 3 Foods"]
[0,0,0,0,0,0,null,0,0,0,0,0]
[5.01,335.01,1.01,5.01,90.01,1,null,335.01,1.01,5.01,90.01,1]
[9.01,670.01,2.0100000000000002,8.93,180.01,2,null,670.01,2.0100000000000002,9.01,180.01,2]
[13.51,1005.01,3.0100000000000002,12.84,270.01,3,null,1005.01,3.0100000000000002,13.51,270.01,3]
[18.010000000000002,1340.01,4.01,16.760000000000002,360.01,4,null,1340.01,4.01,18.010000000000002,360.01,4]
[22.51,1675.01,5.01,20.68,450.01,5,null,1675.01,5.01,22.51,450.01,5]
[27.01,2010.01,6.01,24.59,540.01,6,null,2010.01,6.01,27.01,540.01,6]
[31.01,2345.0100000000002,7.01,28.51,630.01,7,null,2345.0100000000002,7.01,31.01,630.01,7]
[36.01,2680.01,8.01,32.43,720.01,8,null,2680.01,8.01,36.01,720.01,8]
[40.01,3015.01,9.01,36.340000000000003,810.01,9,null,3015.01,9.01,40.01,810.01,9]
[45.01,3350.01,10.01,40.26,900.01,10,null,3350.01,10.01,45.01,900.01,10]
[null,3685.01,11.209999999999999,44.18,990.01,11,null,3685.01,11.01,null,990.01,11]
[null,null,12.51,48.09,1080.01,12,null,null,12.01,null,1080.01,12]
[null,null,13.91,52.01,1170.01,13,null,null,13.01,null,1170.01,13]
[null,null,15.51,55.93,1260.01,14,null,null,14.01,null,1260.01,14]
[null,null,17.310000000000002,59.84,1350.01,15,null,null,15.01,null,1350.01,15]
[null,null,19.310000000000002,63.76,1440.01,16,null,null,16.010000000000002,null,1440.01,16]
[null,null,21.610000000000003,67.680000000000007,1530.01,17,null,null,17.010000000000002,null,1530.01,17]
[null,null,24.110000000000003,71.59,1620.01,18,null,null,18.010000000000002,null,1620.01,18]
[null,null,26.91,75.510000000000005,1710.01,19,null,null,19.010000000000002,null,1710.01,19]
[null,null,30.01,79.430000000000007,1800.01,20,null,null,20.010000000000002,null,1800.01,20]
[null,null,33.51,83.34,1890.01,21,null,null,21.01,null,1890.01,21]
[null,null,37.409999999999997,87.26,1980.01,22,null,null,22.01,null,1980.01,22]
[null,null,41.71,91.18,2070.0100000000002,23,null,null,23.01,null,2070.0100000000002,23]
[null,null,46.61,95.09,2160.0100000000002,24,null,null,24.01,null,2160.0100000000002,24]
[null,null,52.01,99.01,2250.0100000000002,25,null,null,25.01,null,2250.0100000000002,25]
[null,null,58.01,null,2340.0100000000002,26,null,null,26.01,null,2340.0100000000002,26]
[null,null,64.710000000000008,null,2430.0100000000002,27,null,null,27.01,null,2430.0100000000002,27]
[null,null,72.31,null,2520.0100000000002,28,null,null,28.01,null,2520.0100000000002,28]
[null,null,80.61,null,2610.0100000000002,29,null,null,29.01,null,2610.0100000000002,29]
[null,null,90.01,null,2700.01,30,null,null,30.01,null,2700.01,30]
[]
[null,null,null,null,null,null,null,"The above tables are all linear, as per HC Standard 1.2.7 for Cat 3 foods"]
[]
[null,"Note: All values have been inflated by 0.01 (one reportable increment) to match the 'greater than' requirements of the tables provided by FSANZ"]
[]
["Total sugar points tables for various table options, commencing at 5% sugar",null,null,null,null,"Reduction required to maintain existing sugar points",null,null,null,"Profiler points","% reduction of total sugar (via added) to maintain same points (24 point table)","% reduction of total sugar (via added) to maintain same points (25 point table)","% reduction of total sugar (via added) to maintain same points (30 point table)"]
["22 point table","23 point table","24 point table","25 point table","30 pt sugar table","23 point","24 point","25 point","30 point"]
{"$rows_left_out":69}
{"sheet":"Points Table C","index":4,"n_rows":62,"n_cols":6,"rows_kept":62,"cut":false,"hidden":true,"merged":[]}
["Original NPSC profiler points table C, all per 100g",null,"Extended FoPL Profiler points table C, all per 100g"]
["Conc FVNL%","FVNL%","% Foods Fibre","%Foods Protein","NPSC/HSR Points","NPSC Points"]
[0,0,0,0,0,0]
[25,40.01,0.91,1.61,1,1]
[43,60.01,1.91,3.2,2,2]
[52,67.009999999999991,2.81,4.8099999999999996,3,2]
[63,75.009999999999991,3.71,6.41,4,2]
[67,80.009999999999991,4.71,8.01,5,5]
[80,90.009999999999991,5.41,9.61,6,5]
[90,95.009999999999991,6.31,11.61,7,5]
[99.5,99.51,7.31,13.91,8,5]
[100,100,8.41,16.71,9,8]
[null,null,9.7099999999999991,20.010000000000002,10]
[null,null,11.209999999999999,24.01,11]
[null,null,13.01,28.91,12]
[null,null,15.01,34.71,13]
[null,null,17.310000000000002,41.61,14]
[null,null,20.010000000000002,50.01,15]
[]
[]
["Red typeface refers to interpolated values"]
[]
["Note: All values have been inflated by 0.01 (one reportable increment) to match the 'greater than' requirements of the tables provided by FSANZ"]
[]
[]
["Original",null,"Proposal 1"]
["% Foods Fibre","NPSC/HSR Points","% Foods Fibre","NPSC/HSR Points"]
[0,0,0,0]
[0.91,1,3.71,1]
[1.91,2,4.71,2]
[2.81,3,5.41,3]
[3.71,4,6.31,4]
[4.71,5,7.31,5]
[5.41,6,8.41,6]
[6.31,7,9.7099999999999991,7]
[7.31,8,11.209999999999999,8]
[8.41,9,13.01,9]
[9.7099999999999991,10,15.01,10]
[11.209999999999999,11,17.310000000000002,11]
[13.01,12,20.010000000000002,12]
{"$rows_left_out":23}
{"sheet":"Draft calculator","index":5,"n_rows":5,"n_cols":28,"rows_kept":5,"cut":false,"hidden":false,"merged":[]}
["HSR Category (select from drop down)","Product","Company","Energy (kj/100g)","Saturated fat (g/100g)","Total sugars (g/100g)","Sodium (mg/100g)","Fibre (g/100g)","Protein (g/100g)","Concentrated FVNL (%)","FVNL (%)","Wholegrain (%)","Adjusted fibre","HSR Profiler Score (Live)","HSR Star Points (Live)","Health Star Rating (live)","NPSC Category","All FVNL concentrated?","Total FVNL %","HSR Energy Points","HSR Sat Fat Points","HSR Tot Sug Points","HSR Na Points","HSR Total A points","HSR FVNL Points","HSR Fibre Points","HSR Protein Points","HSR Total C Points"]
[null,"Enter product name","Enter company name",0,0,0,0,0,0,0,0,0,{"$f":"H2+(L2*0.2*H2/100)","v":0},{"$f":"$X2-$AB2","v":{"$error":"#N/A"}},{"$f":"IF(ROUND(10.499-(((N2-VLOOKUP($A2,Lookups!$A$55:$D$64,3))/(VLOOKUP($A2,Lookups!$A$55:$D$64,4))*VLOOKUP($A2,Lookups!$C$2:$D$11,2))),0)<1,1,IF(ROUND(10.499-(((N2-VLOOKUP($A2,Lookups!$A$55:$D$64,3))/(VLOOKUP($A2,Lookups!$A$55:$D$64,4))*VLOOKUP($A2,Lookups!$C$2:$D$11,2))),0)<11,ROUND(10.499-(((N2-VLOOKUP($A2,Lookups!$A$55:$D$64,3))/(VLOOKUP($A2,Lookups!$A$55:$D$64,4))*VLOOKUP($A2,Lookups!$C$2:$D$11,2))),0),10))","v":{"$error":"#N/A"}},{"$f":"IF((SUM(D2:L2)=0),\"J\",VLOOKUP(O2,Lookups!$A$1:$B$11,2))","v":"J"},{"$f":"VLOOKUP(A2,Lookups!$A$126:$C$135,3)","v":{"$error":"#N/A"}},{"$f":"IF(AND(J2>0,K2=0),\"Yes\",\"No\")","v":"No"},{"$f":"ROUND(100*(K2+2*J2)/(K2+2*J2+(100-J2-K2)),2)","v":0},{"$f":"IF($Q2<>3,VLOOKUP($D2,'Points Table A'!$B$3:$F$33,5),VLOOKUP($D2,'Points Table A'!$H$3:$L$33,5))","v":{"$error":"#N/A"}},{"$f":"IF($Q2<>3,VLOOKUP($E2,'Points Table A'!$C$3:$F$33,4),VLOOKUP($E2,'Points Table A'!$I$3:$L$33,4))","v":{"$error":"#N/A"}},{"$f":"IF($Q2<>3,VLOOKUP($F2,'Points Table A'!$D$3:$F$33,3),VLOOKUP($F2,'Points Table A'!$J$3:$L$33,3))","v":{"$error":"#N/A"}},{"$f":"IF($Q2<>3,VLOOKUP($G2,'Points Table A'!$E$3:$F$33,2),VLOOKUP($G2,'Points Table A'!$K$3:$L$33,2))","v":{"$error":"#N/A"}},{"$f":"SUM(T2:W2)","v":{"$error":"#N/A"}},{"$f":"IF($R2=Lookups!$B$113,VLOOKUP($J2,'Points Table C'!$A$3:$F$11,5),VLOOKUP($S2,'Points Table C'!$B$3:$F$11,4))","v":0},{"$f":"IF($Q2=1,0,VLOOKUP($M2,'Points Table C'!$C$3:$E$18,3))","v":{"$error":"#N/A"}},{"$f":"VLOOKUP($I2,'Points Table C'!$D$3:$E$18,2)","v":0},{"$f":"IF($X2<Lookups!$C$106,(Y2+Z2+AA2),IF(Y2>=Lookups!$C$120,(Y2+Z2+AA2),Y2+Z2))","v":{"$error":"#N/A"}}]
[null,"Enter product name","Enter company name",0,0,0,0,0,0,0,0,0,{"$f":"H3+(L3*0.2*H3/100)","v":0},{"$error":"#N/A"},{"$f":"IF(ROUND(10.499-(((N3-VLOOKUP($A3,Lookups!$A$55:$D$64,3))/(VLOOKUP($A3,Lookups!$A$55:$D$64,4))*VLOOKUP($A3,Lookups!$C$2:$D$11,2))),0)<1,1,IF(ROUND(10.499-(((N3-VLOOKUP($A3,Lookups!$A$55:$D$64,3))/(VLOOKUP($A3,Lookups!$A$55:$D$64,4))*VLOOKUP($A3,Lookups!$C$2:$D$11,2))),0)<11,ROUND(10.499-(((N3-VLOOKUP($A3,Lookups!$A$55:$D$64,3))/(VLOOKUP($A3,Lookups!$A$55:$D$64,4))*VLOOKUP($A3,Lookups!$C$2:$D$11,2))),0),10))","v":{"$error":"#N/A"}},{"$f":"IF((SUM(D3:L3)=0),\"J\",VLOOKUP(O3,Lookups!$A$1:$B$11,2))","v":"J"},{"$f":"VLOOKUP(A3,Lookups!$A$126:$C$135,3)","v":{"$error":"#N/A"}},{"$f":"IF(AND(J3>0,K3=0),\"Yes\",\"No\")","v":"No"},{"$f":"ROUND(100*(K3+2*J3)/(K3+2*J3+(100-J3-K3)),2)","v":0},{"$f":"IF($Q3<>3,VLOOKUP($D3,'Points Table A'!$B$3:$F$33,5),VLOOKUP($D3,'Points Table A'!$H$3:$L$33,5))","v":{"$error":"#N/A"}},{"$f":"IF($Q3<>3,VLOOKUP($E3,'Points Table A'!$C$3:$F$33,4),VLOOKUP($E3,'Points Table A'!$I$3:$L$33,4))","v":{"$error":"#N/A"}},{"$f":"IF($Q3<>3,VLOOKUP($F3,'Points Table A'!$D$3:$F$33,3),VLOOKUP($F3,'Points Table A'!$J$3:$L$33,3))","v":{"$error":"#N/A"}},{"$f":"IF($Q3<>3,VLOOKUP($G3,'Points Table A'!$E$3:$F$33,2),VLOOKUP($G3,'Points Table A'!$K$3:$L$33,2))","v":{"$error":"#N/A"}},{"$f":"SUM(T3:W3)","v":{"$error":"#N/A"}},{"$f":"IF($R3=Lookups!$B$113,VLOOKUP($J3,'Points Table C'!$A$3:$F$11,5),VLOOKUP($S3,'Points Table C'!$B$3:$F$11,4))","v":0},{"$f":"IF($Q3=1,0,VLOOKUP($M3,'Points Table C'!$C$3:$E$18,3))","v":{"$error":"#N/A"}},{"$f":"VLOOKUP($I3,'Points Table C'!$D$3:$E$18,2)","v":0},{"$f":"IF($X3<Lookups!$C$106,(Y3+Z3+AA3),IF(Y3>=Lookups!$C$120,(Y3+Z3+AA3),Y3+Z3))","v":{"$error":"#N/A"}}]
[null,"Enter product name","Enter company name",0,0,0,0,0,0,0,0,0,0,{"$error":"#N/A"},{"$f":"IF(ROUND(10.499-(((N4-VLOOKUP($A4,Lookups!$A$55:$D$64,3))/(VLOOKUP($A4,Lookups!$A$55:$D$64,4))*VLOOKUP($A4,Lookups!$C$2:$D$11,2))),0)<1,1,IF(ROUND(10.499-(((N4-VLOOKUP($A4,Lookups!$A$55:$D$64,3))/(VLOOKUP($A4,Lookups!$A$55:$D$64,4))*VLOOKUP($A4,Lookups!$C$2:$D$11,2))),0)<11,ROUND(10.499-(((N4-VLOOKUP($A4,Lookups!$A$55:$D$64,3))/(VLOOKUP($A4,Lookups!$A$55:$D$64,4))*VLOOKUP($A4,Lookups!$C$2:$D$11,2))),0),10))","v":{"$error":"#N/A"}},{"$f":"IF((SUM(D4:L4)=0),\"J\",VLOOKUP(O4,Lookups!$A$1:$B$11,2))","v":"J"},{"$f":"VLOOKUP(A4,Lookups!$A$126:$C$135,3)","v":{"$error":"#N/A"}},"No",0,{"$f":"IF($Q4<>3,VLOOKUP($D4,'Points Table A'!$B$3:$F$33,5),VLOOKUP($D4,'Points Table A'!$H$3:$L$33,5))","v":{"$error":"#N/A"}},{"$f":"IF($Q4<>3,VLOOKUP($E4,'Points Table A'!$C$3:$F$33,4),VLOOKUP($E4,'Points Table A'!$I$3:$L$33,4))","v":{"$error":"#N/A"}},{"$f":"IF($Q4<>3,VLOOKUP($F4,'Points Table A'!$D$3:$F$33,3),VLOOKUP($F4,'Points Table A'!$J$3:$L$33,3))","v":{"$error":"#N/A"}},{"$f":"IF($Q4<>3,VLOOKUP($G4,'Points Table A'!$E$3:$F$33,2),VLOOKUP($G4,'Points Table A'!$K$3:$L$33,2))","v":{"$error":"#N/A"}},{"$error":"#N/A"},{"$f":"IF($R4=Lookups!$B$113,VLOOKUP($J4,'Points Table C'!$A$3:$F$11,5),VLOOKUP($S4,'Points Table C'!$B$3:$F$11,4))","v":0},{"$f":"IF($Q4=1,0,VLOOKUP($M4,'Points Table C'!$C$3:$E$18,3))","v":{"$error":"#N/A"}},{"$f":"VLOOKUP($I4,'Points Table C'!$D$3:$E$18,2)","v":0},{"$f":"IF($X4<Lookups!$C$106,(Y4+Z4+AA4),IF(Y4>=Lookups!$C$120,(Y4+Z4+AA4),Y4+Z4))","v":{"$error":"#N/A"}}]
[null,"Enter product name","Enter company name",0,0,0,0,0,0,0,0,0,0,{"$error":"#N/A"},{"$f":"IF(ROUND(10.499-(((N5-VLOOKUP($A5,Lookups!$A$55:$D$64,3))/(VLOOKUP($A5,Lookups!$A$55:$D$64,4))*VLOOKUP($A5,Lookups!$C$2:$D$11,2))),0)<1,1,IF(ROUND(10.499-(((N5-VLOOKUP($A5,Lookups!$A$55:$D$64,3))/(VLOOKUP($A5,Lookups!$A$55:$D$64,4))*VLOOKUP($A5,Lookups!$C$2:$D$11,2))),0)<11,ROUND(10.499-(((N5-VLOOKUP($A5,Lookups!$A$55:$D$64,3))/(VLOOKUP($A5,Lookups!$A$55:$D$64,4))*VLOOKUP($A5,Lookups!$C$2:$D$11,2))),0),10))","v":{"$error":"#N/A"}},{"$f":"IF((SUM(D5:L5)=0),\"J\",VLOOKUP(O5,Lookups!$A$1:$B$11,2))","v":"J"},{"$f":"VLOOKUP(A5,Lookups!$A$126:$C$135,3)","v":{"$error":"#N/A"}},"No",0,{"$f":"IF($Q5<>3,VLOOKUP($D5,'Points Table A'!$B$3:$F$33,5),VLOOKUP($D5,'Points Table A'!$H$3:$L$33,5))","v":{"$error":"#N/A"}},{"$f":"IF($Q5<>3,VLOOKUP($E5,'Points Table A'!$C$3:$F$33,4),VLOOKUP($E5,'Points Table A'!$I$3:$L$33,4))","v":{"$error":"#N/A"}},{"$f":"IF($Q5<>3,VLOOKUP($F5,'Points Table A'!$D$3:$F$33,3),VLOOKUP($F5,'Points Table A'!$J$3:$L$33,3))","v":{"$error":"#N/A"}},{"$f":"IF($Q5<>3,VLOOKUP($G5,'Points Table A'!$E$3:$F$33,2),VLOOKUP($G5,'Points Table A'!$K$3:$L$33,2))","v":{"$error":"#N/A"}},{"$error":"#N/A"},{"$f":"IF($R5=Lookups!$B$113,VLOOKUP($J5,'Points Table C'!$A$3:$F$11,5),VLOOKUP($S5,'Points Table C'!$B$3:$F$11,4))","v":0},{"$f":"IF($Q5=1,0,VLOOKUP($M5,'Points Table C'!$C$3:$E$18,3))","v":{"$error":"#N/A"}},{"$f":"VLOOKUP($I5,'Points Table C'!$D$3:$E$18,2)","v":0},{"$f":"IF($X5<Lookups!$C$106,(Y5+Z5+AA5),IF(Y5>=Lookups!$C$120,(Y5+Z5+AA5),Y5+Z5))","v":{"$error":"#N/A"}}]

{"sheet":"Drop-down, HSR categories","index":6,"n_rows":10,"n_cols":1,"rows_kept":10,"cut":false,"hidden":true,"merged":[]}
["Beverages, non-dairy"]
["Core Cereals"]
["Core Dairy - beverages"]
["Core Dairy - cheese"]
["Core Dairy - yoghurt, soft cheese"]
["Fats, oils"]
["Fruit"]
["Non-core foods"]
["Protein"]
["Vegetables"]